BDBM50084432 CHEMBL3426697
SMILES O[C@@H](CNCCCCCNC(=O)CCN1CCC(CC1)OC(=O)Nc1ccccc1-c1ccccc1)c1ccc(O)c2[nH]c(=O)ccc12
InChI Key InChIKey=FUIVIZCFQUCDAW-XIFFEERXSA-N
Data  1 KI  1 EC50
  Tab Delimited (TSV)   2D SDfile   Computed 3D by Vconf -m prep SDfile
Find this compound or compounds like it in BindingDB:
Activity Spreadsheet -- Enzyme Inhibition Constant Data from BindingDB
Found 2 hits for monomerid = 50084432
TargetMuscarinic acetylcholine receptor M3(Homo sapiens (Human))
Theravance Biopharma
Curated by ChEMBL
LigandPNGBDBM50084432(CHEMBL3426697)
Affinity DataKi:  0.100nM. Assay description: Displacement of [3H]NMS from human muscarinic M3 receptor expressing CHO-K1 cells incubated for 60 mins or 6 hrs by liquid scintillation counting
In DepthDetails ArticlePubMed
TargetBeta-2 adrenergic receptor(Homo sapiens (Human))
Theravance Biopharma
Curated by ChEMBL
LigandPNGBDBM50084432(CHEMBL3426697)
Affinity DataEC50:  0.126nM. Assay description: Agonist activity at human beta2 adrenergic receptor expressed in HEK293 cells assessed as cAMP accumulation using [125I]cAMP by scintillation countin...
In DepthDetails ArticlePubMed