BDBM50084648 5-[1-[2-(4-Chloro-phenylsulfanyl)-5-nitro-phenyl]-meth-(Z)-ylidene]-2-thioxo-thiazolidin-4-one::5-[2-(4-Chloro-phenylsulfanyl)-5-nitro-benzylidene]-2-thioxo-thiazolidin-4-one::CHEMBL362443::CHEMBL444807
SMILES [O-][N+](=O)c1ccc(Sc2ccc(Cl)cc2)c(C=C2SC(S)=NC2=O)c1
InChI Key InChIKey=RVEPOYQRHGOYMW-UHFFFAOYSA-N
Data  2 IC50
  Tab Delimited (TSV)   2D SDfile   Computed 3D by Vconf -m prep SDfile
Find this compound or compounds like it in BindingDB:
Activity Spreadsheet -- Enzyme Inhibition Constant Data from BindingDB
Found 2 hits for monomerid = 50084648
TargetGenome polyprotein(Hepatitis C virus)
University Of Wollongong
Curated by ChEMBL
LigandPNGBDBM50084648(5-[1-[2-(4-Chloro-phenylsulfanyl)-5-nitro-phenyl]-...)
Affinity DataIC50:  3.20E+3nM. Assay description: Inhibitory concentration against hepatitis C virus NS3 protease
In DepthDetails ArticlePubMed
TargetGenome polyprotein(Human rhinovirus B)
University Of Queensland
Curated by ChEMBL
LigandPNGBDBM50084648(5-[1-[2-(4-Chloro-phenylsulfanyl)-5-nitro-phenyl]-...)
Affinity DataIC50:  3.20E+3nM. Assay description: Inhibitory concentration against ProteaseChecked by Author
In DepthDetails ArticlePubMed