BDBM50084929 1,12-Bis(triethyl ammonium)dodecane dibromide::CHEMBL146507::N,N,N,N',N',N'-Hexaethyl-1,12-dodecane diaminium dibromide
SMILES CC[N+](CC)(CC)CCCCCCCCCCCC[N+](CC)(CC)CC
InChI Key InChIKey=PAXLJBJIRDJUTN-UHFFFAOYSA-N
Data  1 IC50
  Tab Delimited (TSV)   2D SDfile   Computed 3D by Vconf -m prep SDfile
Find this compound or compounds like it in BindingDB:
Activity Spreadsheet -- Enzyme Inhibition Constant Data from BindingDB
Found 1 hit for monomerid = 50084929
TargetPhospholipase B(Cryptococcus neoformans)
The University Of Sydney
Curated by ChEMBL
LigandPNGBDBM50084929(1,12-Bis(triethyl ammonium)dodecane dibromide | CH...)
Affinity DataIC50: >2.50E+5nM. Assay description: Inhibition of Cryptococccus neoformans H99 PLB1activity
In DepthDetails ArticlePubMed