BDBM50084953 2-Methyl-biphenyl-4,4'-dicarboxylic acid 4-amide 4'-{[4-methoxy-3-(4-methyl-piperazin-1-yl)-phenyl]-amide}::CHEMBL147071
SMILES COc1ccc(NC(=O)c2ccc(cc2)-c2ccc(cc2C)C(N)=O)cc1N1CCN(C)CC1
InChI Key InChIKey=VFXRXIHKXXMGNA-UHFFFAOYSA-N
Data  4 IC50
  Tab Delimited (TSV)   2D SDfile   Computed 3D by Vconf -m prep SDfile
Find this compound or compounds like it in BindingDB:
Activity Spreadsheet -- Enzyme Inhibition Constant Data from BindingDB
Found 4 hits for monomerid = 50084953
Target5-hydroxytryptamine receptor 1A(Rattus norvegicus (rat))
University Of Groningen
Curated by ChEMBL
LigandPNGBDBM50084953(2-Methyl-biphenyl-4,4'-dicarboxylic acid 4-amide 4...)
Affinity DataIC50:  57nM. Assay description: Inhibition activity against 5-hydroxytryptamine 1A receptor in rat hippocampus membranes using radio binding assays
In DepthDetails ArticlePubMed
TargetSodium-dependent serotonin transporter(Homo sapiens (Human))
University Of Groningen
Curated by ChEMBL
LigandPNGBDBM50084953(2-Methyl-biphenyl-4,4'-dicarboxylic acid 4-amide 4...)
Affinity DataIC50: >1.00E+3nM. Assay description: Inhibition of 5-hydroxytryptamine reuptake
In DepthDetails ArticlePubMed
Target5-hydroxytryptamine receptor 1B(Rattus norvegicus (Rat))
University Of Groningen
Curated by ChEMBL
LigandPNGBDBM50084953(2-Methyl-biphenyl-4,4'-dicarboxylic acid 4-amide 4...)
Affinity DataIC50:  1.30nM. Assay description: Inhibition affinity against 5-HT-1B receptor in rat frontal cortex using radio binding assay
In DepthDetails ArticlePubMed
Target5-hydroxytryptamine receptor 1D(Homo sapiens (Human))
University Of Groningen
Curated by ChEMBL
LigandPNGBDBM50084953(2-Methyl-biphenyl-4,4'-dicarboxylic acid 4-amide 4...)
Affinity DataIC50:  10nM. Assay description: Inhibition affinity against 5-HT-1D receptor in bovine caudate nucleus using radio binding assay
In DepthDetails ArticlePubMed