BDBM50085462 CHEMBL3427699
SMILES CNC(=O)OC[C@H]1O[C@H]([C@H](O)[C@@H]1O)n1cnc2c(N)ncnc12
InChI Key InChIKey=HJFULAPSZBQQMV-IOSLPCCCSA-N
Data  1 IC50
  Tab Delimited (TSV)   2D SDfile   Computed 3D by Vconf -m prep SDfile
Find this compound or compounds like it in BindingDB:
Activity Spreadsheet -- Enzyme Inhibition Constant Data from BindingDB
Found 1 hit for monomerid = 50085462
TargetSodium/nucleoside cotransporter 2(Homo sapiens (Human))
Kissei Pharmaceutical
Curated by ChEMBL
LigandPNGBDBM50085462(CHEMBL3427699)
Affinity DataIC50: >1.00E+5nM. Assay description: Inhibition of human CNT2 expressed in COS7 cells assessed as reduction in sodium-dependent [14C]-inosine uptake in presence of Na+ by liquid scintill...
In DepthDetails ArticlePubMed