BDBM50085628 2-[7-(4-Chloro-phenylsulfanyl)-heptylsulfanyl]-5-pyridin-3-ylmethyl-1H-pyrimidin-4-one::CHEMBL340004
SMILES Clc1ccc(SCCCCCCCSc2ncc(Cc3cccnc3)c(=O)[nH]2)cc1
InChI Key InChIKey=KMPGQDSROONSKQ-UHFFFAOYSA-N
Data  1 IC50
  Tab Delimited (TSV)   2D SDfile   Computed 3D by Vconf -m prep SDfile
Find this compound or compounds like it in BindingDB:
Activity Spreadsheet -- Enzyme Inhibition Constant Data from BindingDB
Found 1 hit for monomerid = 50085628
TargetPlatelet-activating factor acetylhydrolase(Homo sapiens (Human))
Smithkline Beecham Pharmaceuticals
Curated by ChEMBL
LigandPNGBDBM50085628(2-[7-(4-Chloro-phenylsulfanyl)-heptylsulfanyl]-5-p...)
Affinity DataIC50:  250nM. Assay description: Inhibition of lipoprotein-associated phospholipase A2 (Lp-PLA2)
In DepthDetails ArticlePubMed