BDBM50085632 5-(6-Methyl-pyridin-3-ylmethyl)-2-(4-phenyl-butoxy)-1H-pyrimidin-4-one::CHEMBL128445
SMILES Cc1ccc(Cc2cnc(OCCCCc3ccccc3)[nH]c2=O)cn1
InChI Key InChIKey=MDXRBEPMPMIIJJ-UHFFFAOYSA-N
Data  1 IC50
  Tab Delimited (TSV)   2D SDfile   Computed 3D by Vconf -m prep SDfile
Find this compound or compounds like it in BindingDB:
Activity Spreadsheet -- Enzyme Inhibition Constant Data from BindingDB
Found 1 hit for monomerid = 50085632
TargetPlatelet-activating factor acetylhydrolase(Homo sapiens (Human))
Smithkline Beecham Pharmaceuticals
Curated by ChEMBL
LigandPNGBDBM50085632(5-(6-Methyl-pyridin-3-ylmethyl)-2-(4-phenyl-butoxy...)
Affinity DataIC50:  1.20E+4nM. Assay description: Inhibition of lipoprotein-associated phospholipase A2 (Lp-PLA2)
In DepthDetails ArticlePubMed