BDBM50085932 CHEMBL3425687
SMILES CN(C)CCNc1nc(nc2ccc(C)cc12)-c1cc2ccccc2o1
InChI Key InChIKey=OUJNVVSCJAERQT-UHFFFAOYSA-N
Data  1 IC50
  Tab Delimited (TSV)   2D SDfile   Computed 3D by Vconf -m prep SDfile
Find this compound or compounds like it in BindingDB:
Activity Spreadsheet -- Enzyme Inhibition Constant Data from BindingDB
Found 1 hit for monomerid = 50085932
TargetCell division protein FtsZ(Bacillus subtilis)
University Of California Davis
Curated by ChEMBL
LigandPNGBDBM50085932(CHEMBL3425687)
Affinity DataIC50: >1.28E+5nM. Assay description: Inhibition of Bacillus subtilis FtsZ GTPase activity after 5 mins by enzyme-coupled inhibition assay
In DepthDetails ArticlePubMed