BDBM50085986 CHEMBL267258::N-{4-(Biphenyl-2-ylmethyl-isobutyl-amino)-1-[2-(4-fluoro-benzoyl)-benzoyl]-pyrrolidin-2-ylmethyl}-3-[4-(2,4-dioxo-thiazolidin-5-ylidenemethyl)-phenyl]-acrylamide
SMILES CC(C)CN(Cc1ccccc1-c1ccccc1)[C@@H]1C[C@@H](CNC(=O)C=Cc2ccc(C=C3SC(O)=NC3=O)cc2)N(C1)C(=O)c1ccccc1C(=O)c1ccc(F)cc1
InChI Key InChIKey=GTNUCDHEVGOKQK-IOLBBIBUSA-N
Data  1 IC50
  Tab Delimited (TSV)   2D SDfile   Computed 3D by Vconf -m prep SDfile
Find this compound or compounds like it in BindingDB:
Activity Spreadsheet -- Enzyme Inhibition Constant Data from BindingDB
Found 1 hit for monomerid = 50085986
TargetCytosolic phospholipase A2(Homo sapiens (Human))
Shionogi
Curated by ChEMBL
LigandPNGBDBM50085986(CHEMBL267258 | N-{4-(Biphenyl-2-ylmethyl-isobutyl-...)
Affinity DataIC50:  3.10nM. Assay description: Inhibition of Human cPLA2 alpha using Enzyme assay(PC/DOG assay)
In DepthDetails ArticlePubMed