BDBM50086053 5-Methoxy-6-trifluoromethyl-2,3-dihydro-indole-1-carboxylic acid [3-(4-methyl-pyridin-3-yl)-phenyl]-amide::CHEMBL273345
SMILES COc1cc2CCN(C(=O)Nc3cccc(c3)-c3cnccc3C)c2cc1C(F)(F)F
InChI Key InChIKey=VSGPZSVKVXFLOY-UHFFFAOYSA-N
Data  2 KI  1 IC50
  Tab Delimited (TSV)   2D SDfile   Computed 3D by Vconf -m prep SDfile
Find this compound or compounds like it in BindingDB:
Activity Spreadsheet -- Enzyme Inhibition Constant Data from BindingDB
Found 3 hits for monomerid = 50086053
Target5-hydroxytryptamine receptor 2C(Homo sapiens (Human))
Smithkline Beecham Pharmaceuticals
Curated by ChEMBL
LigandPNGBDBM50086053(5-Methoxy-6-trifluoromethyl-2,3-dihydro-indole-1-c...)
Affinity DataKi:  0.630nM. Assay description: Binding affinity towards human cloned 5-hydroxytryptamine receptor 2C in HEK293 cells, using [3H]mesulergine as radioligand.Checked by Author
In DepthDetails ArticlePubMed
Target5-hydroxytryptamine receptor 2A(Homo sapiens (Human))
Smithkline Beecham Pharmaceuticals
Curated by ChEMBL
LigandPNGBDBM50086053(5-Methoxy-6-trifluoromethyl-2,3-dihydro-indole-1-c...)
Affinity DataKi:  251nM. Assay description: Binding affinity towards human cloned 5-hydroxytryptamine receptor 2A in HEK293 cells, using [3H]ketanserin as radioligand.Checked by Author
In DepthDetails ArticlePubMed
TargetCytochrome P450 1A2(Homo sapiens (Human))
Smithkline Beecham Pharmaceuticals
Curated by ChEMBL
LigandPNGBDBM50086053(5-Methoxy-6-trifluoromethyl-2,3-dihydro-indole-1-c...)
Affinity DataIC50:  8.00E+3nM. Assay description: Inhibition of heterologously expressed human cytochrome P450 1A2.Checked by Author
In DepthDetails ArticlePubMed