BDBM50086058 5-Methoxy-6-trifluoromethyl-2,3-dihydro-indole-1-carboxylic acid pyridin-3-ylamide::CHEMBL14352
SMILES COc1cc2CCN(C(=O)Nc3cccnc3)c2cc1C(F)(F)F
InChI Key InChIKey=ROZXAOHUYCQNLS-UHFFFAOYSA-N
Data  4 KI  1 IC50
  Tab Delimited (TSV)   2D SDfile   Computed 3D by Vconf -m prep SDfile
Find this compound or compounds like it in BindingDB:
Activity Spreadsheet -- Enzyme Inhibition Constant Data from BindingDB
Found 5 hits for monomerid = 50086058
Target5-hydroxytryptamine receptor 2C(Homo sapiens (Human))
Smithkline Beecham Pharmaceuticals
Curated by ChEMBL
LigandPNGBDBM50086058(5-Methoxy-6-trifluoromethyl-2,3-dihydro-indole-1-c...)
Affinity DataKi:  10nM. Assay description: Binding affinity towards human cloned 5-hydroxytryptamine receptor 2C in HEK293 cells, using [3H]mesulergine as radioligand.Checked by Author
In DepthDetails ArticlePubMed
Target5-hydroxytryptamine receptor 2C(Homo sapiens (Human))
Smithkline Beecham Pharmaceuticals
Curated by ChEMBL
LigandPNGBDBM50086058(5-Methoxy-6-trifluoromethyl-2,3-dihydro-indole-1-c...)
Affinity DataKi:  10nM. Assay description: Binding affinity towards cloned human 5-hydroxytryptamine 2C receptor expressed in HEK 293 cells using [3H]mesulergine as radioligand
In DepthDetails ArticlePubMed
Target5-hydroxytryptamine receptor 2A(Homo sapiens (Human))
Smithkline Beecham Pharmaceuticals
Curated by ChEMBL
LigandPNGBDBM50086058(5-Methoxy-6-trifluoromethyl-2,3-dihydro-indole-1-c...)
Affinity DataKi:  1.00E+3nM. Assay description: Binding affinity towards human 5-hydroxytryptamine 2A receptor expressed in HEK 293 cells using [3H]ketanserin as radioligand
In DepthDetails ArticlePubMed
Target5-hydroxytryptamine receptor 2A(Homo sapiens (Human))
Smithkline Beecham Pharmaceuticals
Curated by ChEMBL
LigandPNGBDBM50086058(5-Methoxy-6-trifluoromethyl-2,3-dihydro-indole-1-c...)
Affinity DataKi:  1.00E+3nM. Assay description: Binding affinity towards human cloned 5-hydroxytryptamine receptor 2A in HEK293 cells, using [3H]ketanserin as radioligand.Checked by Author
In DepthDetails ArticlePubMed
TargetCytochrome P450 1A2(Homo sapiens (Human))
Smithkline Beecham Pharmaceuticals
Curated by ChEMBL
LigandPNGBDBM50086058(5-Methoxy-6-trifluoromethyl-2,3-dihydro-indole-1-c...)
Affinity DataIC50:  20nM. Assay description: Inhibition of heterologously expressed human cytochrome P450 1A2.Checked by Author
In DepthDetails ArticlePubMed