BDBM50086252 CHEMBL3425762
SMILES CN(C)c1nc(Cc2ccccc2)cc2CCNCCc12
InChI Key InChIKey=XIAVVRQAPQWNQX-UHFFFAOYSA-N
Data  1 KI  1 EC50
  Tab Delimited (TSV)   2D SDfile   Computed 3D by Vconf -m prep SDfile
Find this compound or compounds like it in BindingDB:
Activity Spreadsheet -- Enzyme Inhibition Constant Data from BindingDB
Found 2 hits for monomerid = 50086252
Target5-hydroxytryptamine receptor 2C(Homo sapiens (Human))
University Of Cambridge
Curated by ChEMBL
LigandPNGBDBM50086252(CHEMBL3425762)
Affinity DataKi:  12nM. Assay description: Inhibition of Cy3B conjugated serotonin analogue binding to human recombinant 5-HT2C receptor expressed in Swiss mouse 3T3 cell membranes after 60 mi...
In DepthDetails ArticlePubMed
Target5-hydroxytryptamine receptor 2B(Homo sapiens (Human))
University Of Cambridge
Curated by ChEMBL
LigandPNGBDBM50086252(CHEMBL3425762)
Affinity DataEC50:  30nM. Assay description: Agonist activity at human recombinant 5-HT2B receptor expressed in CHOK1 cells assessed as induction of Ca2+ mobilization after 1 hr by FLIPR assay
In DepthDetails ArticlePubMed