BDBM50086368 4-Benzyl-1-[2-(2H-[1,2,4]triazol-3-ylsulfanyl)-ethyl]-piperidine::CHEMBL347753
SMILES C(CN1CCC(Cc2ccccc2)CC1)Sc1nnc[nH]1
InChI Key InChIKey=MSJYIZYVCUYMCU-UHFFFAOYSA-N
Data  3 IC50
  Tab Delimited (TSV)   2D SDfile   Computed 3D by Vconf -m prep SDfile
Find this compound or compounds like it in BindingDB:
Activity Spreadsheet -- Enzyme Inhibition Constant Data from BindingDB
Found 3 hits for monomerid = 50086368
TargetGlutamate receptor ionotropic, NMDA 2A(Homo sapiens (Human))
Parke-Davis Pharmaceutical Research
Curated by ChEMBL
LigandPNGBDBM50086368(4-Benzyl-1-[2-(2H-[1,2,4]triazol-3-ylsulfanyl)-eth...)
Affinity DataIC50: >1.00E+5nM. Assay description: Antagonistic activity against NR1A/2A receptors in frog oocytes
In DepthDetails ArticlePubMed
TargetGlutamate receptor ionotropic, NMDA 2B(Homo sapiens (Human))
Parke-Davis Pharmaceutical Research
Curated by ChEMBL
LigandPNGBDBM50086368(4-Benzyl-1-[2-(2H-[1,2,4]triazol-3-ylsulfanyl)-eth...)
Affinity DataIC50:  130nM. Assay description: Antagonistic activity against NR1A/2B receptor in frog oocytes
In DepthDetails ArticlePubMed
TargetGlutamate receptor ionotropic, NMDA 2C(Homo sapiens (Human))
Parke-Davis Pharmaceutical Research
Curated by ChEMBL
LigandPNGBDBM50086368(4-Benzyl-1-[2-(2H-[1,2,4]triazol-3-ylsulfanyl)-eth...)
Affinity DataIC50: >1.00E+5nM. Assay description: Antagonistic activity against NR1A/2C receptor in frog oocytes
In DepthDetails ArticlePubMed