BDBM50086377 4-Benzyl-1-[2-(1H-imidazol-2-ylsulfanyl)-ethyl]-piperidine::CHEMBL147355
SMILES C(CN1CCC(Cc2ccccc2)CC1)Sc1ncc[nH]1
InChI Key InChIKey=XSQXTIBXURCUAD-UHFFFAOYSA-N
Data  3 IC50
  Tab Delimited (TSV)   2D SDfile   Computed 3D by Vconf -m prep SDfile
Find this compound or compounds like it in BindingDB:
Activity Spreadsheet -- Enzyme Inhibition Constant Data from BindingDB
Found 3 hits for monomerid = 50086377
TargetGlutamate receptor ionotropic, NMDA 2C(Homo sapiens (Human))
Parke-Davis Pharmaceutical Research
Curated by ChEMBL
LigandPNGBDBM50086377(4-Benzyl-1-[2-(1H-imidazol-2-ylsulfanyl)-ethyl]-pi...)
Affinity DataIC50: >1.00E+5nM. Assay description: Antagonistic activity against NR1A/2C receptor in frog oocytes
In DepthDetails ArticlePubMed
TargetGlutamate receptor ionotropic, NMDA 2B(Homo sapiens (Human))
Parke-Davis Pharmaceutical Research
Curated by ChEMBL
LigandPNGBDBM50086377(4-Benzyl-1-[2-(1H-imidazol-2-ylsulfanyl)-ethyl]-pi...)
Affinity DataIC50:  70nM. Assay description: Antagonistic activity against NR1A/2B receptor in frog oocytes
In DepthDetails ArticlePubMed
TargetGlutamate receptor ionotropic, NMDA 2A(Homo sapiens (Human))
Parke-Davis Pharmaceutical Research
Curated by ChEMBL
LigandPNGBDBM50086377(4-Benzyl-1-[2-(1H-imidazol-2-ylsulfanyl)-ethyl]-pi...)
Affinity DataIC50: >1.00E+5nM. Assay description: Antagonistic activity against NR1A/2A receptors in frog oocytes
In DepthDetails ArticlePubMed