BDBM50086883 2-{2-[2-(8-Carbamoylmethyl-6,9-dioxo-2-oxa-7,10-diaza-bicyclo[11.2.2]heptadeca-1(16),13(17),14-trien-11-yl)-2-hydroxy-ethylamino]-3-phenyl-propionylamino}-3-methyl-pentanoic acid (1-carb amoyl-2-methyl-propyl)-amide::CHEMBL281586
SMILES CCC(C)C(NC(=O)C(Cc1ccccc1)NC[C@H](O)[C@@H]1Cc2ccc(OCCCC(=O)N[C@@H](CC(N)=O)C(=O)N1)cc2)C(=O)NC(C(C)C)C(N)=O
InChI Key InChIKey=MZSDMXITFPLOAJ-JXTPPVFKSA-N
Data  1 KI
  Tab Delimited (TSV)   2D SDfile   Computed 3D by Vconf -m prep SDfile
Find this compound or compounds like it in BindingDB:
Activity Spreadsheet -- Enzyme Inhibition Constant Data from BindingDB
Found 1 hit for monomerid = 50086883
TargetGag-Pol polyprotein [489-587](Human immunodeficiency virus type 1)
University Of Queensland
Curated by ChEMBL
LigandPNGBDBM50086883(2-{2-[2-(8-Carbamoylmethyl-6,9-dioxo-2-oxa-7,10-di...)
Affinity DataKi:  12nM. Assay description: binding affinity towards HIV-1 Protease enzyme
In DepthDetails ArticlePubMed