BDBM50086892 2-[4'-(2-Benzyl-benzofuran-3-yl)-3,5-dibromo-biphenyl-4-yloxy]-3-phenyl-propionic acid::CHEMBL286541
SMILES OC(=O)C(Cc1ccccc1)Oc1c(Br)cc(cc1Br)-c1ccc(cc1)-c1c(Cc2ccccc2)oc2ccccc12
InChI Key InChIKey=JSVZERXVTQQPLV-UHFFFAOYSA-N
Data  1 IC50
  Tab Delimited (TSV)   2D SDfile   Computed 3D by Vconf -m prep SDfile
Find this compound or compounds like it in BindingDB:
Activity Spreadsheet -- Enzyme Inhibition Constant Data from BindingDB
Found 1 hit for monomerid = 50086892
TargetTyrosine-protein phosphatase non-receptor type 1(Homo sapiens (Human))
Wyeth-Ayerst Research
Curated by ChEMBL
LigandPNGBDBM50086892(2-[4'-(2-Benzyl-benzofuran-3-yl)-3,5-dibromo-biphe...)
Affinity DataIC50:  38nM. Assay description: In vitro inhibitory activity against human recombinant protein tyrosine phosphatase 1b (PTP1B)
In DepthDetails ArticlePubMed