BDBM50086913 2-[4'-(2-Butyl-benzo[b]thiophen-3-yl)-biphenyl-4-yloxy]-3-phenyl-propionic acid::CHEMBL24695
SMILES CCCCc1sc2ccccc2c1-c1ccc(cc1)-c1ccc(OC(Cc2ccccc2)C(O)=O)cc1
InChI Key InChIKey=GILGJJVLNYZSAA-UHFFFAOYSA-N
Data  1 IC50
  Tab Delimited (TSV)   2D SDfile   Computed 3D by Vconf -m prep SDfile
Find this compound or compounds like it in BindingDB:
Activity Spreadsheet -- Enzyme Inhibition Constant Data from BindingDB
Found 1 hit for monomerid = 50086913
TargetTyrosine-protein phosphatase non-receptor type 1(Homo sapiens (Human))
Wyeth-Ayerst Research
Curated by ChEMBL
LigandPNGBDBM50086913(2-[4'-(2-Butyl-benzo[b]thiophen-3-yl)-biphenyl-4-y...)
Affinity DataIC50:  170nM. Assay description: In vitro inhibitory activity against human recombinant protein tyrosine phosphatase 1b (PTP1B)
In DepthDetails ArticlePubMed