BDBM50086915 4'-(2-Butyl-benzo[b]thiophen-3-yl)-biphenyl-4-ol::4'-(2-butylbenzo[b]thiophen-3-yl)biphenyl-4-ol::CHEMBL284664
SMILES CCCCc1sc2ccccc2c1-c1ccc(cc1)-c1ccc(O)cc1
InChI Key InChIKey=MERADDQYWVLJMW-UHFFFAOYSA-N
Data  2 IC50
  Tab Delimited (TSV)   2D SDfile   Computed 3D by Vconf -m prep SDfile
Find this compound or compounds like it in BindingDB:
Activity Spreadsheet -- Enzyme Inhibition Constant Data from BindingDB
Found 2 hits for monomerid = 50086915
TargetTyrosine-protein phosphatase non-receptor type 1(Homo sapiens (Human))
Tsinghua University
Curated by ChEMBL
LigandPNGBDBM50086915(4'-(2-Butyl-benzo[b]thiophen-3-yl)-biphenyl-4-ol |...)
Affinity DataIC50:  692nM. Assay description: Binding affinity to human recombinant PTP1B
In DepthDetails ArticlePubMed
TargetTyrosine-protein phosphatase non-receptor type 1(Homo sapiens (Human))
Tsinghua University
Curated by ChEMBL
LigandPNGBDBM50086915(4'-(2-Butyl-benzo[b]thiophen-3-yl)-biphenyl-4-ol |...)
Affinity DataIC50:  700nM. Assay description: In vitro inhibitory activity against human recombinant protein tyrosine phosphatase 1b (PTP1B)
In DepthDetails ArticlePubMed