BDBM50086946 2-{4'-[2-(4-Fluoro-benzyl)-benzo[b]thiophen-3-yl]-biphenyl-4-yloxy}-3-phenyl-propionic acid::CHEMBL430909
SMILES OC(=O)C(Cc1ccccc1)Oc1ccc(cc1)-c1ccc(cc1)-c1c(Cc2ccc(F)cc2)sc2ccccc12
InChI Key InChIKey=IMQBGSILNRDJIN-UHFFFAOYSA-N
Data  1 IC50
  Tab Delimited (TSV)   2D SDfile   Computed 3D by Vconf -m prep SDfile
Find this compound or compounds like it in BindingDB:
Activity Spreadsheet -- Enzyme Inhibition Constant Data from BindingDB
Found 1 hit for monomerid = 50086946
TargetTyrosine-protein phosphatase non-receptor type 1(Homo sapiens (Human))
Wyeth-Ayerst Research
Curated by ChEMBL
LigandPNGBDBM50086946(2-{4'-[2-(4-Fluoro-benzyl)-benzo[b]thiophen-3-yl]-...)
Affinity DataIC50:  120nM. Assay description: In vitro inhibitory activity against human recombinant protein tyrosine phosphatase 1b (PTP1B)
In DepthDetails ArticlePubMed