BDBM50086986 2-[4'-(2-Benzyl-benzofuran-3-yl)-3,5-dibromo-biphenyl-4-yloxy]-octanoic acid::CHEMBL25189
SMILES CCCCCCC(Oc1c(Br)cc(cc1Br)-c1ccc(cc1)-c1c(Cc2ccccc2)oc2ccccc12)C(O)=O
InChI Key InChIKey=HXJGQXHMYYXNGF-UHFFFAOYSA-N
Data  1 IC50
  Tab Delimited (TSV)   2D SDfile   Computed 3D by Vconf -m prep SDfile
Find this compound or compounds like it in BindingDB:
Activity Spreadsheet -- Enzyme Inhibition Constant Data from BindingDB
Found 1 hit for monomerid = 50086986
TargetTyrosine-protein phosphatase non-receptor type 1(Homo sapiens (Human))
Wyeth-Ayerst Research
Curated by ChEMBL
LigandPNGBDBM50086986(2-[4'-(2-Benzyl-benzofuran-3-yl)-3,5-dibromo-biphe...)
Affinity DataIC50:  23nM. Assay description: In vitro inhibitory activity against human recombinant protein tyrosine phosphatase 1b (PTP1B)
In DepthDetails ArticlePubMed