BDBM50087171 CHEMBL3426646
SMILES NCc1ccc(cc1-c1cccc(c1)C(=O)Nc1cccc(C(O)=O)c1F)C(=O)Nc1ccncc1F
InChI Key InChIKey=SLFPCEZMHGANLQ-UHFFFAOYSA-N
Data  1 IC50
  Tab Delimited (TSV)   2D SDfile   Computed 3D by Vconf -m prep SDfile
Find this compound or compounds like it in BindingDB:
Activity Spreadsheet -- Enzyme Inhibition Constant Data from BindingDB
Found 1 hit for monomerid = 50087171
TargetRho-associated protein kinase 2(Homo sapiens (Human))
Agoralaan Abis
Curated by ChEMBL
LigandPNGBDBM50087171(CHEMBL3426646)
Affinity DataIC50:  3.5nM. Assay description: Inhibition of human N-terminal GST-tagged ROCK2 expressed in baculovirus-infected insect cells using long S6 kinase peptide as substrate by radiometr...
In DepthDetails ArticlePubMed