BDBM50087276 3-Amino-propane-1-sulfinic acid (Homohypotaurine)::3-ammoniopropane-1-sulfinate::CHEMBL32102
SMILES NCCCS(O)=O
InChI Key InChIKey=NPGXQDBNBFXJKB-UHFFFAOYSA-N
Data  1 IC50  1 EC50
  Tab Delimited (TSV)   2D SDfile   Computed 3D by Vconf -m prep SDfile
Find this compound or compounds like it in BindingDB:
Activity Spreadsheet -- Enzyme Inhibition Constant Data from BindingDB
Found 2 hits for monomerid = 50087276
TargetGamma-aminobutyric acid type B receptor subunit 1/2(Rattus norvegicus (Rat))
TBA
Curated by ChEMBL
LigandPNGBDBM50087276(3-Amino-propane-1-sulfinic acid (Homohypotaurine) ...)
Affinity DataIC50:  60nM. Assay description: Binding affinity against Gamma-aminobutyric acid type B receptor in rat brain synaptosomes after 30 minutes
In DepthDetails Article
TargetGamma-aminobutyric acid receptor subunit rho-1(Homo sapiens (Human))
University Of Sydney
Curated by ChEMBL
LigandPNGBDBM50087276(3-Amino-propane-1-sulfinic acid (Homohypotaurine) ...)
Affinity DataEC50:  4.60E+3nM. Assay description: Partial agonist activity against human rho-1 subunit GABA-C receptor expressed in Xenopus oocytes
In DepthDetails ArticlePubMed