BDBM50087779 3-(3-Carbamoyl-phenyl)-acrylic acid 2-hydroxy-ethyl ester::CHEMBL48110
SMILES NC(=O)c1cccc(\C=C\C(=O)OCCO)c1
InChI Key InChIKey=PKRNSRQUWAACBR-SNAWJCMRSA-N
Data  1 EC50
  Tab Delimited (TSV)   2D SDfile   Computed 3D by Vconf -m prep SDfile
Find this compound or compounds like it in BindingDB:
Activity Spreadsheet -- Enzyme Inhibition Constant Data from BindingDB
Found 1 hit for monomerid = 50087779
TargetGenome polyprotein(Human rhinovirus B)
Agouron Pharmaceuticals
Curated by ChEMBL
LigandPNGBDBM50087779(3-(3-Carbamoyl-phenyl)-acrylic acid 2-hydroxy-ethy...)
Affinity DataEC50:  2.00E+4nM. Assay description: Antiviral activity using H1HeLa cells (ATCC) infected with HRV-14
In DepthDetails ArticlePubMed