BDBM50087830 CHEMBL49808::Cyclopent-2-ene-1,2-dicarboxylic acid 1-(4-carbamimidoyl-benzylamide) 2-cyclohexylamide
SMILES NC(=N)c1ccc(CNC(=O)[C@@H]2CCC=C2C(=O)NC2CCCCC2)cc1
InChI Key InChIKey=ITIDAOUPMWXDRR-QGZVFWFLSA-N
Data  2 IC50
  Tab Delimited (TSV)   2D SDfile   Computed 3D by Vconf -m prep SDfile
Find this compound or compounds like it in BindingDB:
Activity Spreadsheet -- Enzyme Inhibition Constant Data from BindingDB
Found 2 hits for monomerid = 50087830
TargetProthrombin(Homo sapiens (Human))
Link£Ping University
Curated by ChEMBL
LigandPNGBDBM50087830(CHEMBL49808 | Cyclopent-2-ene-1,2-dicarboxylic aci...)
Affinity DataIC50:  1.50E+3nM. Assay description: In vitro inhibitory concentration of compound against human thrombin
In DepthDetails ArticlePubMed
TargetProthrombin(Homo sapiens (Human))
Link£Ping University
Curated by ChEMBL
LigandPNGBDBM50087830(CHEMBL49808 | Cyclopent-2-ene-1,2-dicarboxylic aci...)
Affinity DataIC50:  1.51E+3nM. Assay description: In vitro for the inhibition of thrombin
In DepthDetails ArticlePubMed