BDBM50087849 CHEMBL268534::c[ Lys12, Asp15] glucagon-NH2
SMILES CSCC[C@@H](NC(=O)[C@@H](CC(C)C)NC(=O)[C@@H](Cc1c[nH]c2ccccc12)NC(=O)[C@@H](CCC(N)=O)NC(=O)[C@H](NC(=O)[C@@H](Cc1ccccc1)NC(=O)[C@@H](CC(O)=O)NC(=O)[C@@H](CCC(N)=O)NC(=O)[C@@H](C)NC(=O)[C@@H](CCCN=C(N)N)NC(=O)[C@@H](CCCN=C(N)N)NC(=O)[C@H](CO)NC(=O)[C@H]1CC(=O)NCCCC[C@H](NC(=O)[C@H](CO)NC(=O)[C@@H](Cc2ccc(O)cc2)NC(=O)[C@@H](CC(O)=O)NC(=O)[C@@H](CO)NC(=O)[C@H](NC(=O)[C@@H](Cc2ccccc2)NC(=O)[C@H](NC(=O)CNC(=O)[C@@H](CCC(N)=O)NC(=O)[C@@H](CO)NC(=O)[C@H](N)Cc2c[nH]cn2)[C@H](C)O)[C@H](C)O)C(=O)N[C@@H](Cc2ccc(O)cc2)C(=O)N[C@H](CC(C)C)C(=O)N1)C(C)C)C(=O)N[C@H](CC(N)=O)C(=O)N[C@H]([C@H](C)O)C(N)=O
InChI Key InChIKey=KWFWOSHABYCTAM-XJOPBACLSA-N
Data  1 IC50
  Tab Delimited (TSV)   2D SDfile   Computed 3D by Vconf -m prep SDfile
Find this compound or compounds like it in BindingDB:
Activity Spreadsheet -- Enzyme Inhibition Constant Data from BindingDB
Found 1 hit for monomerid = 50087849
TargetGlucagon receptor(Rattus norvegicus)
University Of Arizona
Curated by ChEMBL
LigandPNGBDBM50087849(CHEMBL268534 | c[ Lys12, Asp15] glucagon-NH2)
Affinity DataIC50:  1.20E+3nM. Assay description: In vitro receptor binding affinity (95% CL) using rat liver plasma membrane bioassay
In DepthDetails ArticlePubMed