BDBM50087908 CHEMBL417546::N''-[(4-methylphenyl)sulfonyl]carbonohydrazonic diamide
SMILES [#6]-c1ccc(cc1)S(=O)(=O)[#7]\[#7]=[#6](/[#7])-[#7]
InChI Key InChIKey=OAJCLQPYBGDEJD-UHFFFAOYSA-N
Data  2 KI
  Tab Delimited (TSV)   2D SDfile   Computed 3D by Vconf -m prep SDfile
Find this compound or compounds like it in BindingDB:
Activity Spreadsheet -- Enzyme Inhibition Constant Data from BindingDB
Found 2 hits for monomerid = 50087908
TargetProthrombin(Human)
University of Florence
Curated by ChEMBL
LigandPNGBDBM50087908(CHEMBL417546 | N''-[(4-methylphenyl)sulfonyl]carbo...)
Affinity DataKi:  270nM. Assay description: Inhibitory activity against human thrombin (using Chromozym TH as the substrate)
In DepthDetails ArticlePubMed
TargetSerine protease 1/Trypsin-2(Human)
University of Florence
Curated by ChEMBL
LigandPNGBDBM50087908(CHEMBL417546 | N''-[(4-methylphenyl)sulfonyl]carbo...)
Affinity DataKi:  1.78E+3nM. Assay description: Inhibitory activity against human trypsin (using Chromozym TH as the substrate)
In DepthDetails ArticlePubMed