BDBM50088140 CHEMBL3427231::US9365511, 8
SMILES C[C@@H]1CCCN1CCc1ccc(cc1)-c1ccc(CCn2ncnn2)cc1
InChI Key InChIKey=XKUCBPWVGMSFND-GOSISDBHSA-N
Data  2 IC50
  Tab Delimited (TSV)   2D SDfile   Computed 3D by Vconf -m prep SDfile
Find this compound or compounds like it in BindingDB:
Activity Spreadsheet -- Enzyme Inhibition Constant Data from BindingDB
Found 2 hits for monomerid = 50088140
TargetHistamine H3 receptor(Homo sapiens (Human))
Temple University School Of Pharmacy
Curated by ChEMBL
LigandPNGBDBM50088140(CHEMBL3427231 | US9365511, 8)
Affinity DataIC50:  1.20nM. Assay description: Modulation of human histamine H3 receptor expressed in HEK293 cells assessed as change in forskolin-stimulated cAMP level after 1 hr by HTRF assay
In DepthDetails ArticlePubMed
TargetHistamine H3 receptor(Homo sapiens (Human))
Temple University School Of Pharmacy
Curated by ChEMBL
LigandPNGBDBM50088140(CHEMBL3427231 | US9365511, 8)
Affinity DataIC50:  1.20nM. Assay description: Compounds of the present invention were evaluated using the human H3 receptor (H3R) HTRF cAMP assay. In this assay, HEK293 cells expressing the human...
In DepthDetails US Patent