BDBM50088223 CHEMBL61751::E-2-Amino-4-(3-naphthalen-1-yl-allyl) -pentanedioic acid
SMILES N[C@@H](C[C@@H](C\C=C\c1cccc2ccccc12)C(O)=O)C(O)=O
InChI Key InChIKey=SMOYAGNGDQVXBT-XSXXPSGLSA-N
Data  2 KI
  Tab Delimited (TSV)   2D SDfile   Computed 3D by Vconf -m prep SDfile
Find this compound or compounds like it in BindingDB:
Activity Spreadsheet -- Enzyme Inhibition Constant Data from BindingDB
Found 2 hits for monomerid = 50088223
TargetGlutamate receptor ionotropic, kainate 1(Homo sapiens (Human))
Eli Lilly
Curated by ChEMBL
LigandPNGBDBM50088223(CHEMBL61751 | E-2-Amino-4-(3-naphthalen-1-yl-allyl...)
Affinity DataKi:  7nM. Assay description: Binding affinity against human ionotropic glutamate receptor kainate 1 in HK293 cells using [3H]-kainate as radioligand
In DepthDetails ArticlePubMed
TargetGlutamate receptor ionotropic, kainate 2(Homo sapiens (Human))
Eli Lilly
Curated by ChEMBL
LigandPNGBDBM50088223(CHEMBL61751 | E-2-Amino-4-(3-naphthalen-1-yl-allyl...)
Affinity DataKi:  4.37E+3nM. Assay description: Binding affinity against human ionotropic glutamate receptor ionotropic kainate 2 in HEK293 cells using [3H]-kainate as radioligand
In DepthDetails ArticlePubMed