BDBM50088755 5-(2-Bromo-phenyl)-8-chloro-3-methyl-2,3,4,5-tetrahydro-1H-benzo[d]azepin-7-ol::CHEMBL13325::SCH-23390
SMILES CN1CCc2cc(Cl)c(O)cc2C(C1)c1ccccc1Br
InChI Key InChIKey=YFZYRKUTAITPML-UHFFFAOYSA-N
Data  4 KI
  Tab Delimited (TSV)   2D SDfile   Computed 3D by Vconf -m prep SDfile
Find this compound or compounds like it in BindingDB:
Activity Spreadsheet -- Enzyme Inhibition Constant Data from BindingDB
Found 4 hits for monomerid = 50088755
TargetD(1A) dopamine receptor(RAT)
Yale University
Curated by ChEMBL
LigandPNGBDBM50088755(5-(2-Bromo-phenyl)-8-chloro-3-methyl-2,3,4,5-tetra...)
Affinity DataKi:  0.700nM. Assay description: Compound was evaluated for affinity towards dopamine D1-like receptor in homogenate of caudateputamen tissue from rat brain
In DepthDetails ArticlePubMed
Target5-hydroxytryptamine receptor 2C(Rattus norvegicus (Rat))
Yale University
Curated by ChEMBL
LigandPNGBDBM50088755(5-(2-Bromo-phenyl)-8-chloro-3-methyl-2,3,4,5-tetra...)
Affinity DataKi:  12nM. Assay description: Compound was evaluated for affinity towards cerebral 5-hydroxytryptamine 2C receptor in homogenate of caudate putamen tissue from rat brain
In DepthDetails ArticlePubMed
Target5-hydroxytryptamine receptor 2A(Rattus norvegicus (rat))
Yale University
Curated by ChEMBL
LigandPNGBDBM50088755(5-(2-Bromo-phenyl)-8-chloro-3-methyl-2,3,4,5-tetra...)
Affinity DataKi:  22nM. Assay description: Compound was evaluated for affinity towards cerebral 5-hydroxytryptamine 2A receptor in homogenate of caudate putamen tissue from rat brain
In DepthDetails ArticlePubMed
TargetD(2) dopamine receptor(Mus musculus (Mouse))
Yale University
Curated by ChEMBL
LigandPNGBDBM50088755(5-(2-Bromo-phenyl)-8-chloro-3-methyl-2,3,4,5-tetra...)
Affinity DataKi:  583nM. Assay description: Compound was evaluated for affinity towards dopamine D2-like receptor in homogenate of caudate putamen tissue from rat brain
In DepthDetails ArticlePubMed