BDBM50088829 CHEMBL169373::disodium (7Z)-4-methylene-3-[(1E)-3-oxido-3-oxoprop-1-enyl]-8-oxo-7-(pyridin-2-ylmethylene)-5-thia-1-azabicyclo[4.2.0]oct-2-ene-2-carboxylate 5,5-dioxide
SMILES [O-]C(=O)\C=C\C1=C(N2C(\C(=C/c3ccccn3)C2=O)S(=O)(=O)C1=C)C([O-])=O
InChI Key InChIKey=QQYMMFPNJJCTHC-ZHDSEDTHSA-L
Data  2 IC50
  Tab Delimited (TSV)   2D SDfile   Computed 3D by Vconf -m prep SDfile
Find this compound or compounds like it in BindingDB:
Activity Spreadsheet -- Enzyme Inhibition Constant Data from BindingDB
Found 2 hits for monomerid = 50088829
TargetBeta-lactamase(Enterobacter cloacae)
Southern Methodist University
Curated by ChEMBL
LigandPNGBDBM50088829(CHEMBL169373 | disodium (7Z)-4-methylene-3-[(1E)-3...)
Affinity DataIC50:  6.60E+3nM. Assay description: Inhibition of class C beta-lactamase derived from Enterobacter cloacae P99
In DepthDetails ArticlePubMed
TargetBeta-lactamase(Enterobacter cloacae)
Southern Methodist University
Curated by ChEMBL
LigandPNGBDBM50088829(CHEMBL169373 | disodium (7Z)-4-methylene-3-[(1E)-3...)
Affinity DataIC50:  2.50E+3nM. Assay description: Inhibition of class A TEM-1 beta-lactamase derived from Enterobacter cloacae
In DepthDetails ArticlePubMed