BDBM50089147 2-Methyl-9-phenyl-2,3,4,9-tetrahydro-1H-indeno[2,1-c]pyridine::2-Methyl-9-phenyl-2,3,4,9-tetrahydro-1H-indeno[2,1-c]pyridinium::CHEMBL278398::Phenindamine
SMILES CN1CCC2=C(C1)C(c1ccccc21)c1ccccc1
InChI Key InChIKey=ISFHAYSTHMVOJR-UHFFFAOYSA-N
Data  1 KI  1 IC50
  Tab Delimited (TSV)   2D SDfile   Computed 3D by Vconf -m prep SDfile
Find this compound or compounds like it in BindingDB:
Activity Spreadsheet -- Enzyme Inhibition Constant Data from BindingDB
Found 2 hits for monomerid = 50089147
TargetHistamine H1 receptor(RAT)
TBA
Curated by PDSP Ki Database
LigandPNGBDBM50089147(2-Methyl-9-phenyl-2,3,4,9-tetrahydro-1H-indeno[2,1...)
Affinity DataKi:  20nM
In DepthDetails ArticlePubMed
TargetHistamine H1 receptor(Cavia porcellus (domestic guinea pig))
University Of Bath
Curated by ChEMBL
LigandPNGBDBM50089147(2-Methyl-9-phenyl-2,3,4,9-tetrahydro-1H-indeno[2,1...)
Affinity DataIC50:  36nM. Assay description: In vitro antagonistic activity at the Histamine H1 receptor in guinea pig ileum
In DepthDetails ArticlePubMed