BDBM50089192 4-Fluoro-N-(1,3,3-trimethyl-bicyclo[2.2.1]hept-2-yl)-benzenesulfonamide::CHEMBL311039
SMILES CC1(C)C2CCC(C)(C2)C1NS(=O)(=O)c1ccc(F)cc1
InChI Key InChIKey=PBMVETGVYGTZMP-UHFFFAOYSA-N
Data  1 IC50
  Tab Delimited (TSV)   2D SDfile   Computed 3D by Vconf -m prep SDfile
Find this compound or compounds like it in BindingDB:
Activity Spreadsheet -- Enzyme Inhibition Constant Data from BindingDB
Found 1 hit for monomerid = 50089192
TargetAmyloid-beta precursor protein(Homo sapiens (Human))
Amgen
Curated by ChEMBL
LigandPNGBDBM50089192(4-Fluoro-N-(1,3,3-trimethyl-bicyclo[2.2.1]hept-2-y...)
Affinity DataIC50:  5.00E+3nM. Assay description: Inhibition of Abeta42 production by inhibiting Gamma-secretase proteolytic pathway in HEK293 cell stably transfected with a double mutant form of hum...
In DepthDetails ArticlePubMed