BDBM50089258 CHEMBL3577903
SMILES CC[C@@H](N(Cc1cccc(c1)C(O)=O)C(=O)c1cnc2ccccc2c1)c1ccc(C)o1
InChI Key InChIKey=CZIRJKMEALPCDO-HSZRJFAPSA-N
Data  1 IC50
  Tab Delimited (TSV)   2D SDfile   Computed 3D by Vconf -m prep SDfile
Find this compound or compounds like it in BindingDB:
Activity Spreadsheet -- Enzyme Inhibition Constant Data from BindingDB
Found 1 hit for monomerid = 50089258
LigandPNGBDBM50089258(CHEMBL3577903)
Affinity DataIC50:  328nM. Assay description: Antagonist activity against human recombinant TRPM8 expressed in CHO T-rex cells assessed as inhibition of WS12-induced calcium response pre-incubate...
In DepthDetails ArticlePubMed