BDBM50089383 CHEMBL1707983
SMILES CN1CCN(CC1)C(=O)c1ccc(CN2CCOCC2)cc1
InChI Key InChIKey=LWBZVRUFDRCWEP-UHFFFAOYSA-N
Data  1 KI
  Tab Delimited (TSV)   2D SDfile   Computed 3D by Vconf -m prep SDfile
Find this compound or compounds like it in BindingDB:
Activity Spreadsheet -- Enzyme Inhibition Constant Data from BindingDB
Found 1 hit for monomerid = 50089383
TargetHistamine H3 receptor(Homo sapiens (Human))
Janssen Pharmaceutical Companies Of Johnson & Johnson
Curated by ChEMBL
LigandPNGBDBM50089383(CHEMBL1707983)
Affinity DataKi:  22nM. Assay description: Displacement of N-[3H]methylhistamine from human histamine H3 receptor expressed in human SK-N-MC cells after 45 mins
In DepthDetails ArticlePubMed