BDBM50089385 CHEMBL3577967
SMILES OC(=O)c1ccccc1-c1nnc(SCC(=O)Nc2ccccc2Cl)[nH]1
InChI Key InChIKey=PHUGPXWDZZSZJS-UHFFFAOYSA-N
Data  1 KI
  Tab Delimited (TSV)   2D SDfile   Computed 3D by Vconf -m prep SDfile
Find this compound or compounds like it in BindingDB:
Activity Spreadsheet -- Enzyme Inhibition Constant Data from BindingDB
Found 1 hit for monomerid = 50089385
TargetBeta-lactamase(Aeromonas veronii)
North-West University
Curated by ChEMBL
LigandPNGBDBM50089385(CHEMBL3577967)
Affinity DataKi:  2.30E+3nM. Assay description: Inhibition of Aeromonas veronii metallo-beta-lactamase ImiS expressed in Escherichia coli BL21(DE3) using imipenem substrate pre-incubated for 30 min...
In DepthDetails ArticlePubMed