BDBM50089393 CHEMBL3577970
SMILES OC(=O)c1ccccc1-c1nnc(SCC(=O)Nc2cccc(c2)[N+]([O-])=O)[nH]1
InChI Key InChIKey=SLOBRYKYHRELOU-UHFFFAOYSA-N
Data  1 KI
  Tab Delimited (TSV)   2D SDfile   Computed 3D by Vconf -m prep SDfile
Find this compound or compounds like it in BindingDB:
Activity Spreadsheet -- Enzyme Inhibition Constant Data from BindingDB
Found 1 hit for monomerid = 50089393
TargetBeta-lactamase(Aeromonas veronii)
North-West University
Curated by ChEMBL
LigandPNGBDBM50089393(CHEMBL3577970)
Affinity DataKi:  1.90E+3nM. Assay description: Inhibition of Aeromonas veronii metallo-beta-lactamase ImiS expressed in Escherichia coli BL21(DE3) using imipenem substrate pre-incubated for 30 min...
In DepthDetails ArticlePubMed