BDBM50089418 CHEMBL3578000
SMILES [H][C@@]12CCCN1C(=O)[C@@]1([H])CCCN1C(=O)[C@H](Cc1ccccc1)NC(=O)[C@H](C)NC(=O)[C@H](CCCCNC(N)=N)NC(=O)[C@H](Cc1ccccc1)NC(=O)[C@H](Cc1ccccc1)NC(=O)[C@H](CCCNC(N)=N)NC2=O
InChI Key InChIKey=KEMPMTFFIIKEBA-LVXPXGLXSA-N
Data  2 KI  2 EC50
  Tab Delimited (TSV)   2D SDfile   Computed 3D by Vconf -m prep SDfile
Find this compound or compounds like it in BindingDB:
Activity Spreadsheet -- Enzyme Inhibition Constant Data from BindingDB
Found 4 hits for monomerid = 50089418
TargetMelanocortin receptor 4(Mus musculus)
University Of Minnesota
Curated by ChEMBL
LigandPNGBDBM50089418(CHEMBL3578000)
Affinity DataKi:  4nM. Assay description: Displacement of MTII from mouse MC4R expressed in HEK293 cells
In DepthDetails ArticlePubMed
TargetMelanocortin receptor 3(Mus musculus)
University Of Minnesota
Curated by ChEMBL
LigandPNGBDBM50089418(CHEMBL3578000)
Affinity DataKi:  200nM. Assay description: Displacement of MTII from mouse MC3R expressed in HEK293 cells
In DepthDetails ArticlePubMed
TargetMelanocortin receptor 5(Mus musculus (Mouse))
University Of Minnesota
Curated by ChEMBL
LigandPNGBDBM50089418(CHEMBL3578000)
Affinity DataEC50: >1.00E+8nM. Assay description: Agonist activity at mouse MC5R expressed in HEK293 cells by cAMP functional bioassay
In DepthDetails ArticlePubMed
TargetMelanocyte-stimulating hormone receptor(Mus musculus)
University Of Minnesota
Curated by ChEMBL
LigandPNGBDBM50089418(CHEMBL3578000)
Affinity DataEC50: >1.00E+8nM. Assay description: Agonist activity at mouse MC1R expressed in HEK293 cells by cAMP functional bioassay
In DepthDetails ArticlePubMed