BDBM50089442 CHEMBL3578012
SMILES CC(C)C[C@H](NC(=O)C(CN)NC(C)=O)C(=O)N[C@@H](CCCNC(N)=N)C(=O)N[C@@H](Cc1cnc[nH]1)C(=O)N[C@@H](Cc1ccc(O)cc1)C(=O)N[C@@H](CC(C)C)C(=O)N[C@@H](CC(N)=O)C(=O)N[C@@H](CC(C)C)C(=O)N[C@@H](CC(C)C)C(=O)N[C@@H]([C@@H](C)O)C(=O)N[C@@H](CCCNC(N)=N)C(=O)N[C@@H](CCC(N)=O)C(=O)N[C@@H](CCCNC(N)=N)C(=O)N[C@@H](Cc1ccc(O)cc1)C(N)=O
InChI Key
Data  2 EC50
  Tab Delimited (TSV)   2D SDfile   Computed 3D by Vconf -m prep SDfile
Find this compound or compounds like it in BindingDB:
Activity Spreadsheet -- Enzyme Inhibition Constant Data from BindingDB
Found 2 hits for monomerid = 50089442
TargetNeuropeptide Y receptor type 2(Homo sapiens (Human))
Universit£T Leipzig
Curated by ChEMBL
LigandPNGBDBM50089442(CHEMBL3578012)
Affinity DataEC50:  0.398nM. Assay description: Agonist activity at human neuropeptide Y Y2 receptor expressed in COS-7 cells cotransfected with chimeric Gi/q protein assessed as inositol phosphate...
In DepthDetails ArticlePubMed
TargetNeuropeptide Y receptor type 2(Homo sapiens (Human))
Universit£T Leipzig
Curated by ChEMBL
LigandPNGBDBM50089442(CHEMBL3578012)
Affinity DataEC50:  0.400nM. Assay description: Agonist activity at human neuropeptide Y Y2 receptor expressed in COS-7 cells cotransfected with chimeric Gi/q protein assessed as inositol phosphate...
In DepthDetails ArticlePubMed