BDBM50089455 CHEMBL3578197
SMILES CC(=O)N1CCN(CC1)c1ccc(cc1)N1CCN(CC1)c1ccc(cn1)C(=O)NCCCC[C@H](NC(=O)N[C@@H](CCC(O)=O)C(O)=O)C(O)=O
InChI Key InChIKey=LOJVBFZESVZGEX-NSOVKSMOSA-N
Data  1 KI
  Tab Delimited (TSV)   2D SDfile   Computed 3D by Vconf -m prep SDfile
Find this compound or compounds like it in BindingDB:
Activity Spreadsheet -- Enzyme Inhibition Constant Data from BindingDB
Found 1 hit for monomerid = 50089455
TargetGlutamate carboxypeptidase 2(Homo sapiens (Human))
Academy Of Sciences Of The Czech Republic
Curated by ChEMBL
LigandPNGBDBM50089455(CHEMBL3578197)
Affinity DataKi:  0.0710nM. Assay description: Inhibition of antiTEV-tagged GCP2 extracellular portion (aa 44-750) (unknown origin) using folyl-di-L-glutamate as substrate by HPLC-based enzymatic ...
In DepthDetails ArticlePubMed