BDBM50089518 (1R,2R)-1-amino-2-(phosphonomethyl)cyclopropanecarboxylic acid::(1R,2R)-1-amino-2-phosphonomethylcyclopropane-carboxylic acid::CHEMBL287703
SMILES N[C@@]1(C[C@H]1CP(O)(O)=O)C(O)=O
InChI Key InChIKey=RACNCOSUCJNQDH-WVZVXSGGSA-N
Data  5 EC50
  Tab Delimited (TSV)   2D SDfile   Computed 3D by Vconf -m prep SDfile
Find this compound or compounds like it in BindingDB:
Activity Spreadsheet -- Enzyme Inhibition Constant Data from BindingDB
Found 5 hits for monomerid = 50089518
TargetMetabotropic glutamate receptor 4(Homo sapiens (Human))
Università
Curated by ChEMBL
LigandPNGBDBM50089518((1R,2R)-1-amino-2-(phosphonomethyl)cyclopropanecar...)
Affinity DataEC50:  7.90E+3nM. Assay description: Agonistic activity at Metabotropic glutamate receptor 4 expressed in mammalian cells by GTPgammaS binding assay
In DepthDetails ArticlePubMed
TargetMetabotropic glutamate receptor 7(Homo sapiens (Human))
University Paris Descartes
Curated by ChEMBL
LigandPNGBDBM50089518((1R,2R)-1-amino-2-(phosphonomethyl)cyclopropanecar...)
Affinity DataEC50: >1.00E+6nM. Assay description: Agonist activity at mGlu7 receptor expressed in HEK 293 cells assessed as effect on inositol phosphate production
In DepthDetails ArticlePubMed
TargetMetabotropic glutamate receptor 6(Homo sapiens (Human))
University Paris Descartes
Curated by ChEMBL
LigandPNGBDBM50089518((1R,2R)-1-amino-2-(phosphonomethyl)cyclopropanecar...)
Affinity DataEC50: >1.00E+6nM. Assay description: Agonist activity at mGlu6 receptor expressed in HEK 293 cells assessed as effect on inositol phosphate production
In DepthDetails ArticlePubMed
TargetMetabotropic glutamate receptor 4(Homo sapiens (Human))
Università
Curated by ChEMBL
LigandPNGBDBM50089518((1R,2R)-1-amino-2-(phosphonomethyl)cyclopropanecar...)
Affinity DataEC50: >1.00E+6nM. Assay description: Agonist activity at mGlu4 receptor expressed in HEK 293 cells assessed as effect on inositol phosphate production
In DepthDetails ArticlePubMed
TargetMetabotropic glutamate receptor 8(Homo sapiens (Human))
University Paris Descartes
Curated by ChEMBL
LigandPNGBDBM50089518((1R,2R)-1-amino-2-(phosphonomethyl)cyclopropanecar...)
Affinity DataEC50: >3.00E+5nM. Assay description: Agonist activity at mGlu8 receptor expressed in HEK 293 cells assessed as effect on inositol phosphate production
In DepthDetails ArticlePubMed