BDBM50089548 5-((E)-6,6-Dimethyl-hept-2-en-4-ynylamino)-3,4-dihydro-1H-quinolin-2-one::CHEMBL35516
SMILES CC(C)(C)C#C\C=C\CNc1cccc2NC(=O)CCc12
InChI Key InChIKey=WJIWZINPWRBGKM-GQCTYLIASA-N
Data  2 IC50
  Tab Delimited (TSV)   2D SDfile   Computed 3D by Vconf -m prep SDfile
Find this compound or compounds like it in BindingDB:
Activity Spreadsheet -- Enzyme Inhibition Constant Data from BindingDB
Found 2 hits for monomerid = 50089548
TargetChitin synthase 3(Candida albicans)TBA
LigandPNGBDBM50089548(5-((E)-6,6-Dimethyl-hept-2-en-4-ynylamino)-3,4-dih...)
Affinity DataIC50:  2.51E+5nM. Assay description: Inhibition of Candida albicans chitin synthase
In DepthDetails Article
TargetChitin synthase 1(Candida albicans)
Nippon Roche Research Center
Curated by ChEMBL
LigandPNGBDBM50089548(5-((E)-6,6-Dimethyl-hept-2-en-4-ynylamino)-3,4-dih...)
Affinity DataIC50:  71nM. Assay description: Inhibitory of Candida albicans chitin synthase 1
In DepthDetails ArticlePubMed