BDBM50089552 CHEMBL416596::N-((E)-6,6-Dimethyl-hept-2-en-4-ynyl)-N-(2-oxo-1,2,3,4-tetrahydro-quinolin-5-yl)-acetamide
SMILES CC(=O)N(C\C=C\C#CC(C)(C)C)c1cccc2NC(=O)CCc12
InChI Key InChIKey=VKNYDBUDLGIVAD-FNORWQNLSA-N
Data  1 IC50
  Tab Delimited (TSV)   2D SDfile   Computed 3D by Vconf -m prep SDfile
Find this compound or compounds like it in BindingDB:
Activity Spreadsheet -- Enzyme Inhibition Constant Data from BindingDB
Found 1 hit for monomerid = 50089552
TargetChitin synthase 1(Candida albicans)
Nippon Roche Research Center
Curated by ChEMBL
LigandPNGBDBM50089552(CHEMBL416596 | N-((E)-6,6-Dimethyl-hept-2-en-4-yny...)
Affinity DataIC50:  775nM. Assay description: Inhibitory of Candida albicans chitin synthase 1
In DepthDetails ArticlePubMed