BDBM50089564 5-[((E)-6,6-Dimethyl-hept-2-en-4-ynylamino)-methyl]-1H-pyridin-2-one::CHEMBL35416
SMILES CC(C)(C)C#C\C=C\CNCc1ccc(=O)[nH]c1
InChI Key InChIKey=ZQEJKHNHKFEWKM-GQCTYLIASA-N
Data  1 IC50
  Tab Delimited (TSV)   2D SDfile   Computed 3D by Vconf -m prep SDfile
Find this compound or compounds like it in BindingDB:
Activity Spreadsheet -- Enzyme Inhibition Constant Data from BindingDB
Found 1 hit for monomerid = 50089564
TargetChitin synthase 1(Candida albicans)
Nippon Roche Research Center
Curated by ChEMBL
LigandPNGBDBM50089564(5-[((E)-6,6-Dimethyl-hept-2-en-4-ynylamino)-methyl...)
Affinity DataIC50:  2.11E+5nM. Assay description: Inhibitory of Candida albicans chitin synthase 1
In DepthDetails ArticlePubMed