BDBM50089671 CHEMBL3577300
SMILES NCCC[C@@H]1N=C(c2[nH]c(cc2N(CCc2ccc(O)cc2)C1=O)C(O)=O)c1ccc(cc1)-c1ccccc1
InChI Key
Data  4 EC50
  Tab Delimited (TSV)   2D SDfile   Computed 3D by Vconf -m prep SDfile
Find this compound or compounds like it in BindingDB:
Activity Spreadsheet -- Enzyme Inhibition Constant Data from BindingDB
Found 4 hits for monomerid = 50089671
TargetUrotensin-2 receptor(RAT)
Universit£
Curated by ChEMBL
LigandPNGBDBM50089671(CHEMBL3577300)
Affinity DataEC50:  12nM. Assay description: Modulation of urotensin-2 receptor in Sprague-Dawley rat thoracic aortic ring assessed as human urotensin-2 EC50 for induction of aortic ring contrac...
In DepthDetails ArticlePubMed
TargetUrotensin-2 receptor(RAT)
Universit£
Curated by ChEMBL
LigandPNGBDBM50089671(CHEMBL3577300)
Affinity DataEC50:  23nM. Assay description: Modulation of urotensin-2 receptor in Sprague-Dawley rat thoracic aortic ring assessed as urotensin-2 related peptide pEC50 for induction of aortic r...
In DepthDetails ArticlePubMed
TargetUrotensin-2 receptor(RAT)
Universit£
Curated by ChEMBL
LigandPNGBDBM50089671(CHEMBL3577300)
Affinity DataEC50:  12nM. Assay description: Modulation of urotensin-2 receptor in Sprague-Dawley rat thoracic aortic ring assessed as human urotensin-2 pEC50 for induction of aortic ring contra...
In DepthDetails ArticlePubMed
TargetUrotensin-2 receptor(RAT)
Universit£
Curated by ChEMBL
LigandPNGBDBM50089671(CHEMBL3577300)
Affinity DataEC50:  23nM. Assay description: Modulation of urotensin-2 receptor in Sprague-Dawley rat thoracic aortic ring assessed as urotensin-2 related peptide EC50 for induction of aortic ri...
In DepthDetails ArticlePubMed