BDBM50089674 CHEMBL3577315
SMILES CCc1nc(N)ncc1-c1ccc(cc1)C(F)(F)F
InChI Key InChIKey=WPXQPIYQTATADS-UHFFFAOYSA-N
Data  1 IC50
  Tab Delimited (TSV)   2D SDfile   Computed 3D by Vconf -m prep SDfile
Find this compound or compounds like it in BindingDB:
Activity Spreadsheet -- Enzyme Inhibition Constant Data from BindingDB
Found 1 hit for monomerid = 50089674
TargetBeta-hexosaminidase subunit alpha(Homo sapiens (Human))
Sickkids
Curated by ChEMBL
LigandPNGBDBM50089674(CHEMBL3577315)
Affinity DataIC50: >4.00E+5nM. Assay description: Inhibition of human placental HexA using pNPGlcNAc substrate
In DepthDetails ArticlePubMed