BDBM50089751 CHEMBL3577435
SMILES CC1(C)C2CCC1(C)CC2NC(=O)C(CC1CCCC1)NC(=O)N[C@@H](CCCCN)C(O)=O
InChI Key InChIKey=AFDQLRFIAXCERE-UQGFRLLMSA-N
Data  1 IC50
  Tab Delimited (TSV)   2D SDfile   Computed 3D by Vconf -m prep SDfile
Find this compound or compounds like it in BindingDB:
Activity Spreadsheet -- Enzyme Inhibition Constant Data from BindingDB
Found 1 hit for monomerid = 50089751
TargetCarboxypeptidase B2(Homo sapiens (Human))
Institute For Infection Research
Curated by ChEMBL
LigandPNGBDBM50089751(CHEMBL3577435)
Affinity DataIC50:  4nM. Assay description: Inhibition of human activated TAFI incubated for 15 mins by microtiter plate reader based assay
In DepthDetails ArticlePubMed