BDBM50089803 CHEMBL3577589
SMILES [H][C@]12Oc3c4c(C[C@]5([H])N(CCCCCCCC)CC[C@]14[C@]5(O)CCC2=O)ccc3O
InChI Key InChIKey=YFNREDITTYUZBJ-QVGHQYEOSA-N
Data  1 IC50
  Tab Delimited (TSV)   2D SDfile   Computed 3D by Vconf -m prep SDfile
Find this compound or compounds like it in BindingDB:
Activity Spreadsheet -- Enzyme Inhibition Constant Data from BindingDB
Found 1 hit for monomerid = 50089803
TargetToll-like receptor 4(Mus musculus)
National Institute Of Health
Curated by ChEMBL
LigandPNGBDBM50089803(CHEMBL3577589)
Affinity DataIC50:  1.70E+3nM. Assay description: Antagonist activity against TLR4 in mouse BV2 cells assessed as inhibition of LPS-induced nitric oxide production incubated for 24 hrs by 2,3-diamino...
In DepthDetails ArticlePubMed