BDBM50089810 4-(3-Chloro-4-methoxy-benzylamino)-1-(4-hydroxy-cyclohexylamino)-phthalazine-6-carbonitrile; hydrochloride::CHEMBL3084583
SMILES Cl.COc1ccc(CNc2nnc(N[C@H]3CC[C@H](O)CC3)c3ccc(cc23)C#N)cc1Cl
InChI Key InChIKey=JEMBJNLWFAOPSK-BHQIMSFRSA-N
Data  1 IC50
  Tab Delimited (TSV)   2D SDfile   Computed 3D by Vconf -m prep SDfile
Find this compound or compounds like it in BindingDB:
Activity Spreadsheet -- Enzyme Inhibition Constant Data from BindingDB
Found 1 hit for monomerid = 50089810
TargetcGMP-specific 3',5'-cyclic phosphodiesterase(Homo sapiens (Human))
Eisai
Curated by ChEMBL
LigandPNGBDBM50089810(4-(3-Chloro-4-methoxy-benzylamino)-1-(4-hydroxy-cy...)
Affinity DataIC50:  12nM. Assay description: 50% inhibitory concentration against phosphodiesterase 5 (PDE5) from porcine platelets
In DepthDetails ArticlePubMed