BDBM50089878 CHEMBL3581030
SMILES COc1ccc(Cn2c(CCc3ccccc3)nnc2[C@@H](Cc2c[nH]c3ccccc23)NC(=O)c2ccccn2)cc1
InChI Key InChIKey=SJCIADFNBNFHIX-WJOKGBTCSA-N
Data  3 IC50
  Tab Delimited (TSV)   2D SDfile   Computed 3D by Vconf -m prep SDfile
Find this compound or compounds like it in BindingDB:
Activity Spreadsheet -- Enzyme Inhibition Constant Data from BindingDB
Found 3 hits for monomerid = 50089878
TargetGrowth hormone secretagogue receptor type 1(Homo sapiens (Human))
University Of Montpellier
Curated by ChEMBL
LigandPNGBDBM50089878(CHEMBL3581030)
Affinity DataIC50:  0.700nM. Assay description: Displacement of 125I-[His9]-ghrelin from human GHSR1a expressed in LLC-PK1 cells by competitive binding assay
In DepthDetails ArticlePubMed
TargetGrowth hormone secretagogue receptor type 1(Homo sapiens (Human))
University Of Montpellier
Curated by ChEMBL
LigandPNGBDBM50089878(CHEMBL3581030)
Affinity DataIC50:  4.5nM. Assay description: Antagonist activity at GHSR1a (unknown origin) assessed as inhibition of ghrelin-induced intracellular calcium mobilization
In DepthDetails ArticlePubMed
TargetGrowth hormone secretagogue receptor type 1(Homo sapiens (Human))
University Of Montpellier
Curated by ChEMBL
LigandPNGBDBM50089878(CHEMBL3581030)
Affinity DataIC50:  6nM. Assay description: Antagonist activity at human GSHR1a expressed in mouse LTK cells assessed as inhibition of ghrelin-induced reporter gene expression after 6 hrs by CR...
In DepthDetails ArticlePubMed