BDBM50090045 (2,3-Dihydroxy-4-methoxy-phenyl)-(3,4,5-trimethoxy-phenyl)-methanone::CHEMBL94124
SMILES COc1ccc(C(=O)c2cc(OC)c(OC)c(OC)c2)c(O)c1O
InChI Key InChIKey=WCZBBVLCJJAASE-UHFFFAOYSA-N
Data  1 IC50
  Tab Delimited (TSV)   2D SDfile   Computed 3D by Vconf -m prep SDfile
Find this compound or compounds like it in BindingDB:
Activity Spreadsheet -- Enzyme Inhibition Constant Data from BindingDB
Found 1 hit for monomerid = 50090045
TargetTubulin alpha-1A chain(Sus scrofa (Pig))
Arizona State University
Curated by ChEMBL
LigandPNGBDBM50090045((2,3-Dihydroxy-4-methoxy-phenyl)-(3,4,5-trimethoxy...)
Affinity DataIC50:  820nM. Assay description: Inhibition of tubulin polymerization
In DepthDetails ArticlePubMed